Warning removed

6 jobs for libarchive in 5 minutes and 51 seconds (queued for 9 seconds)
latest
Status Job ID Name Coverage
  Test
passed #315123
cppcheck

00:00:59

passed #315124
luacheck

00:00:58

failed #315121
system-tests

00:01:02

failed #315122
system-valgrind-tests

00:01:03

passed #315119
unit-tests

00:01:30

failed #315120
unit-valgrind-tests

00:05:51

 
Name Stage Failure
failed
unit-valgrind-tests Test
==1006==    still reachable: 1,388 bytes in 32 blocks
==1006== suppressed: 0 bytes in 0 blocks
==1006== Reachable blocks (those to which a pointer was found) are not shown.
==1006== To see them, rerun with: --leak-check=full --show-leak-kinds=all
==1006==
==1006== For counts of detected and suppressed errors, rerun with: -v
==1006== ERROR SUMMARY: 9 errors from 9 contexts (suppressed: 0 from 0)
make: *** [tests/Makefile.dir:108: valgrind-c-download] Error 1
ERROR: Job failed: exit code 1
failed
system-valgrind-tests Test
src/lib/picosat-965/picosat.c:1943:11: note: in expansion of macro 'VAR2LIT'
assert (VAR2LIT (v) != UNDEF);
^~~~~~~
LD lib/libupdater.so
LD bin/pkgtransaction
/usr/bin/ld: ./lib/libupdater.so: undefined reference to `shm_open'
collect2: error: ld returned 1 exit status
make: *** [build/Makefile.top:234: bin/pkgtransaction] Error 1
ERROR: Job failed: exit code 1
failed
system-tests Test
src/lib/picosat-965/picosat.c:1943:11: note: in expansion of macro 'VAR2LIT'
assert (VAR2LIT (v) != UNDEF);
^~~~~~~
LD lib/libupdater.so
LD bin/pkgtransaction
/usr/bin/ld: ./lib/libupdater.so: undefined reference to `shm_open'
collect2: error: ld returned 1 exit status
make: *** [build/Makefile.top:234: bin/pkgtransaction] Error 1
ERROR: Job failed: exit code 1