Filter: Add support for VPN_RD sets

32 jobs from int-new in 4 minutes and 14 seconds (queued for 9 seconds)
Status Job ID Name Coverage
  Image
passed #185761
dind allowed to fail
docker_centos-6-amd64

00:00:18

passed #185762
dind allowed to fail
docker_centos-7-amd64

00:00:18

passed #185751
dind allowed to fail
docker_debian-7-amd64

00:00:20

passed #185755
dind allowed to fail
docker_debian-7-i386

00:00:22

passed #185752
dind allowed to fail
docker_debian-8-amd64

00:00:20

passed #185756
dind allowed to fail
docker_debian-8-i386

00:00:19

passed #185753
dind allowed to fail
docker_debian-9-amd64

00:00:23

passed #185757
dind allowed to fail
docker_debian-9-i386

00:00:21

passed #185754
dind allowed to fail
docker_debian-testing-amd64

00:00:22

passed #185758
dind allowed to fail
docker_debian-testing-i386

00:00:19

passed #185759
dind allowed to fail
docker_fedora-25-amd64

00:00:23

passed #185760
dind allowed to fail
docker_fedora-26-amd64

00:00:23

passed #185763
dind allowed to fail
docker_opensuse-42_3-amd64

00:00:22

passed #185764
dind allowed to fail
docker_ubuntu-14_04-amd64

00:00:22

passed #185765
dind allowed to fail
docker_ubuntu-16_04-amd64

00:00:21

 
  Build
passed #185772
docker linux amd64
build-centos-6-amd64

00:02:21

passed #185773
docker linux amd64
build-centos-7-amd64

00:02:10

passed #185766
docker linux amd64
build-debian-7-amd64

00:02:27

failed #185777
docker linux amd64
build-debian-7-i386

00:02:04

passed #185767
docker linux amd64
build-debian-8-amd64

00:02:27

failed #185778
docker linux amd64
build-debian-8-i386

00:02:10

passed #185768
docker linux amd64
build-debian-9-amd64

00:02:29

failed #185779
docker linux amd64
build-debian-9-i386

00:02:11

passed #185769
docker linux amd64
build-debian-testing-amd64

00:02:31

failed #185780
docker linux amd64
build-debian-testing-i386

00:02:16

passed #185770
docker linux amd64
build-fedora-25-amd64

00:02:25

passed #185771
docker linux amd64
build-fedora-26-amd64

00:01:38

passed #185781
freebsd amd64
build-freebsd-11-amd64

00:02:55

failed #185782
freebsd i386
build-freebsd-11-i386

00:02:58

passed #185774
docker linux amd64
build-opensuse-42_3-amd64

00:02:23

passed #185775
docker linux amd64
build-ubuntu-14_04-amd64

00:01:51

passed #185776
docker linux amd64
build-ubuntu-16_04-amd64

00:02:27

 
Name Stage Failure
failed
build-freebsd-11-i386 Build There is an unknown failure, please try again
LD -pthread -L/usr/local/lib -o obj/nest/a-set_test obj/nest/a-set_test.o ...
CC -o obj/nest/a-path_test.o -c nest/a-path_test.c
LD -pthread -L/usr/local/lib -o obj/nest/a-path_test obj/nest/a-path_test.o ...
obj/filter/tree_test [ OK ]
Segmentation fault (core dumped)
gmake: *** [Makefile:160: obj/filter/filter_test.ok] Error 139
You can open up a new split-screen window in (n)vi with :N or :E and then
use ^w to switch between the two.
ERROR: Job failed: Process exited with: 1. Reason was: ()
failed
build-debian-testing-i386 Build
nest/a-path_test.c:216:3: note: in expansion of macro 'bt_test_suite'
bt_test_suite(t_path_include, "Testing including a AS number in AS path");
^~~~~~~~~~~~~
LD -pthread -o obj/nest/a-path_test obj/nest/a-path_test.o ...
obj/filter/tree_test [ OK ]
obj/filter/filter_test: t_rd [FAIL]
obj/filter/filter_test [FAIL]
make: *** [Makefile:160: obj/filter/filter_test.ok] Error 1
ERROR: Job failed: exit code 1
failed
build-debian-9-i386 Build
LD -pthread -o obj/nest/a-set_test obj/nest/a-set_test.o ...
CC -o obj/nest/a-path_test.o -c nest/a-path_test.c
LD -pthread -o obj/nest/a-path_test obj/nest/a-path_test.o ...
obj/filter/tree_test [ OK ]
obj/filter/filter_test: t_rd [FAIL]
obj/filter/filter_test [FAIL]
Makefile:160: recipe for target 'obj/filter/filter_test.ok' failed
make: *** [obj/filter/filter_test.ok] Error 1
ERROR: Job failed: exit code 1
failed
build-debian-8-i386 Build
LD -pthread -o obj/nest/a-set_test obj/nest/a-set_test.o ...
CC -o obj/nest/a-path_test.o -c nest/a-path_test.c
LD -pthread -o obj/nest/a-path_test obj/nest/a-path_test.o ...
obj/filter/tree_test [ OK ]
obj/filter/filter_test: t_rd [FAIL]
obj/filter/filter_test [FAIL]
Makefile:160: recipe for target 'obj/filter/filter_test.ok' failed
make: *** [obj/filter/filter_test.ok] Error 1
ERROR: Job failed: exit code 1
failed
build-debian-7-i386 Build
nest/a-set_test.c:58:7: warning: left shift count >= width of type [enabled by default]
LD -pthread -o obj/nest/a-set_test obj/nest/a-set_test.o ... -lrt
CC -o obj/nest/a-path_test.o -c nest/a-path_test.c
LD -pthread -o obj/nest/a-path_test obj/nest/a-path_test.o ... -lrt
obj/filter/tree_test [ OK ]
obj/filter/filter_test: t_rd [FAIL]
obj/filter/filter_test [FAIL]
make: *** [obj/filter/filter_test.ok] Error 1
ERROR: Job failed: exit code 1